Reaction Details
TargetPlatelet-derived growth factor receptor beta
LigandBDBM50360453
Substrate/Competitorn/a
Meas. Tech.ChEMBL_795520 (CHEMBL1935843)
IC50>100000±n/a nM
Citation Suzuki, NShiota, TWatanabe, FHaga, NMurashi, TOhara, TMatsuo, KOmori, NYari, HDohi, KInoue, MIguchi, MSentou, JWada, T Discovery of novel 5-alkynyl-4-anilinopyrimidines as potent, orally active dual inhibitors of EGFR and Her-2 tyrosine kinases. Bioorg Med Chem Lett22:456-60 (2011) 
 
Platelet-derived growth factor receptor beta
Name:Platelet-derived growth factor receptor beta
Type:Enzyme
Mol. Mass.:123922.25
Organism:Homo sapiens (Human)
Description:P09619
Residue:1106
BDBM50360453
NameBDBM50360453
Synonyms:CHEMBL1934626
TypeSmall organic molecule
Emp. Form.C31H27ClF2N4O
Mol. Mass.545.022
SMILESCc1ncnc(Nc2ccc(OCc3cccc(F)c3)c(Cl)c2)c1C#Cc1ccc(CN2CCCC2)c(F)c1