Reaction Details
TargetAurora kinase A
LigandBDBM50360453
Substrate/Competitorn/a
Meas. Tech.ChEMBL_795521 (CHEMBL1935844)
IC50>100000±n/a nM
Citation Suzuki, NShiota, TWatanabe, FHaga, NMurashi, TOhara, TMatsuo, KOmori, NYari, HDohi, KInoue, MIguchi, MSentou, JWada, T Discovery of novel 5-alkynyl-4-anilinopyrimidines as potent, orally active dual inhibitors of EGFR and Her-2 tyrosine kinases. Bioorg Med Chem Lett22:456-60 (2011) 
 
Aurora kinase A
Name:Aurora kinase A
Type:Serine/threonine-protein kinase
Mol. Mass.:45830.98
Organism:Homo sapiens (Human)
Description:O14965
Residue:403
BDBM50360453
NameBDBM50360453
Synonyms:CHEMBL1934626
TypeSmall organic molecule
Emp. Form.C31H27ClF2N4O
Mol. Mass.545.022
SMILESCc1ncnc(Nc2ccc(OCc3cccc(F)c3)c(Cl)c2)c1C#Cc1ccc(CN2CCCC2)c(F)c1