Reaction Details
TargetEpidermal growth factor receptor
LigandBDBM50360456
Substrate/Competitorn/a
Meas. Tech.ChEMBL_795532 (CHEMBL1935855)
IC50 22±n/a nM
Citation Suzuki, NShiota, TWatanabe, FHaga, NMurashi, TOhara, TMatsuo, KOmori, NYari, HDohi, KInoue, MIguchi, MSentou, JWada, T Discovery of novel 5-alkynyl-4-anilinopyrimidines as potent, orally active dual inhibitors of EGFR and Her-2 tyrosine kinases. Bioorg Med Chem Lett22:456-60 (2011) 
 
Epidermal growth factor receptor
Name:Epidermal growth factor receptor
Type:Receptor Kinase Domain
Mol. Mass.:134279.59
Organism:Homo sapiens (Human)
Description:P00533
Residue:1210
BDBM50360456
NameBDBM50360456
Synonyms:CHEMBL1934622
TypeSmall organic molecule
Emp. Form.C30H28ClFN4O3S
Mol. Mass.579.085
SMILESCc1ncnc(Nc2ccc(OCc3cccc(F)c3)c(Cl)c2)c1C#Cc1ccc(CNCCS(C)(=O)=O)cc1