Reaction Details
TargetEpidermal growth factor receptor
LigandBDBM50360463
Substrate/Competitorn/a
Meas. Tech.ChEMBL_795532 (CHEMBL1935855)
IC50 55±n/a nM
Citation Suzuki, NShiota, TWatanabe, FHaga, NMurashi, TOhara, TMatsuo, KOmori, NYari, HDohi, KInoue, MIguchi, MSentou, JWada, T Discovery of novel 5-alkynyl-4-anilinopyrimidines as potent, orally active dual inhibitors of EGFR and Her-2 tyrosine kinases. Bioorg Med Chem Lett22:456-60 (2011) 
 
Epidermal growth factor receptor
Name:Epidermal growth factor receptor
Type:Receptor Kinase Domain
Mol. Mass.:134279.59
Organism:Homo sapiens (Human)
Description:P00533
Residue:1210
BDBM50360463
NameBDBM50360463
Synonyms:CHEMBL1933083
TypeSmall organic molecule
Emp. Form.C29H26ClFN4O
Mol. Mass.500.994
SMILESCN(C)Cc1cccc(c1)C#Cc1c(C)ncnc1Nc1ccc(OCc2cccc(F)c2)c(Cl)c1