Reaction Details
TargetEpidermal growth factor receptor
LigandBDBM50360467
Substrate/Competitorn/a
Meas. Tech.ChEMBL_795532 (CHEMBL1935855)
IC50 98±n/a nM
Citation Suzuki, NShiota, TWatanabe, FHaga, NMurashi, TOhara, TMatsuo, KOmori, NYari, HDohi, KInoue, MIguchi, MSentou, JWada, T Discovery of novel 5-alkynyl-4-anilinopyrimidines as potent, orally active dual inhibitors of EGFR and Her-2 tyrosine kinases. Bioorg Med Chem Lett22:456-60 (2011) 
 
Epidermal growth factor receptor
Name:Epidermal growth factor receptor
Type:Receptor Kinase Domain
Mol. Mass.:134279.59
Organism:Homo sapiens (Human)
Description:P00533
Residue:1210
BDBM50360467
NameBDBM50360467
Synonyms:CHEMBL1934633
TypeSmall organic molecule
Emp. Form.C30H28ClFN4O
Mol. Mass.515.021
SMILESCc1ncnc(Nc2ccc(OCc3cccc(F)c3)c(Cl)c2)c1\C=C\c1ccc(CNC2CC2)cc1