Reaction Details
TargetReceptor tyrosine-protein kinase erbB-2
LigandBDBM5447
Substrate/Competitorn/a
Meas. Tech.ChEMBL_795516 (CHEMBL1935839)
IC50 240±n/a nM
Citation Suzuki, NShiota, TWatanabe, FHaga, NMurashi, TOhara, TMatsuo, KOmori, NYari, HDohi, KInoue, MIguchi, MSentou, JWada, T Discovery of novel 5-alkynyl-4-anilinopyrimidines as potent, orally active dual inhibitors of EGFR and Her-2 tyrosine kinases. Bioorg Med Chem Lett22:456-60 (2011) 
 
Receptor tyrosine-protein kinase erbB-2
Name:Receptor tyrosine-protein kinase erbB-2
Type:n/a
Mol. Mass.:137894.47
Organism:Homo sapiens (Human)
Description:P04626
Residue:1255
BDBM5447
NameBDBM5447
Synonyms:CHEMBL939 Iressa N-(3-chloro-4-fluorophenyl)-7-methoxy-6-[3-(morpholin-4-yl)propoxy]quinazolin-4-amine US10507209, Compound Gefitinib US9730934, Gefitinib WO2022090481, Example gefitinib cid_123631
TypeSmall organic molecule
Emp. Form.C22H24ClFN4O3
Mol. Mass.446.902
SMILESCOc1cc2ncnc(Nc3ccc(F)c(Cl)c3)c2cc1OCCCN1CCOCC1