Reaction Details
TargetProgesterone receptor
LigandBDBM50360469
Substrate/Competitorn/a
Meas. Tech.ChEMBL_795615 (CHEMBL1936045)
IC50 430±n/a nM
Citation Abid Masood, MFarrant, EMorao, IBazin, MPerez, MBunnage, MEFancy, SAPeakman, T Lead diversification. Application to existing drug molecules: mifepristone 1 and antalarmin 8. Bioorg Med Chem Lett22:723-8 (2011) 
 
Progesterone receptor
Name:Progesterone receptor
Type:Protein
Mol. Mass.:98979.52
Organism:Homo sapiens (Human)
Description:P06401
Residue:933
BDBM50360469
NameBDBM50360469
Synonyms:CHEMBL1934745
TypeSmall organic molecule
Emp. Form.C28H33NO5
Mol. Mass.463.5653
SMILESCC#C[C@]1(O)CC[C@H]2[C@@H]3CCC(=O)C(CCC(O)=O)=C3[C@H](C[C@]12C)c1ccc(cc1)N(C)C=O