Reaction Details
TargetAdenosine 5'-monophosphoramidase HINT1
LigandBDBM50360476
Substrate/Competitorn/a
Meas. Tech.ChEMBL_795618 (CHEMBL1936048)
Ki 400000±n/a nM
Citation Bardaweel, SKGhosh, BWagner, CR Synthesis and evaluation of potential inhibitors of human and Escherichia coli histidine triad nucleotide binding proteins. Bioorg Med Chem Lett22:558-60 (2011) 
 
Adenosine 5'-monophosphoramidase HINT1
Name:Adenosine 5'-monophosphoramidase HINT1
Type:PROTEIN
Mol. Mass.:13803.77
Organism:Homo sapiens (Human)
Description:ChEMBL_795618
Residue:126
BDBM50360476
NameBDBM50360476
Synonyms:CHEMBL1934752
TypeSmall organic molecule
Emp. Form.C21H22N6O5
Mol. Mass.438.4366
SMILESNc1ncnc2n(cnc12)[C@@H]1O[C@H](COC(=O)CCc2c[nH]c3ccccc23)[C@@H](O)[C@H]1O