Reaction Details
TargetAdenosine 5'-monophosphoramidase HINT1
LigandBDBM50360478
Substrate/Competitorn/a
Meas. Tech.ChEMBL_795618 (CHEMBL1936048)
Ki 139000±n/a nM
Citation Bardaweel, SKGhosh, BWagner, CR Synthesis and evaluation of potential inhibitors of human and Escherichia coli histidine triad nucleotide binding proteins. Bioorg Med Chem Lett22:558-60 (2011) 
 
Adenosine 5'-monophosphoramidase HINT1
Name:Adenosine 5'-monophosphoramidase HINT1
Type:PROTEIN
Mol. Mass.:13803.77
Organism:Homo sapiens (Human)
Description:ChEMBL_795618
Residue:126
BDBM50360478
NameBDBM50360478
Synonyms:CHEMBL1934754
TypeSmall organic molecule
Emp. Form.C21H25N5O5
Mol. Mass.427.4537
SMILESCc1cn([C@H]2C[C@H](N)[C@@H](COC(=O)NCCc3c[nH]c4ccccc34)O2)c(=O)[nH]c1=O