Reaction Details
TargetSphingosine 1-phosphate receptor 3
LigandBDBM23165
Substrate/Competitorn/a
Meas. Tech.ChEMBL_796731 (CHEMBL1938046)
IC50 23±n/a nM
Citation He, XWang, LZheng, ZXiao, JZhong, WLi, S Novel immunomodulators based on an oxazolin-2-one-4-carboxamide scaffold. Bioorg Med Chem Lett22:553-7 (2011) 
 
Sphingosine 1-phosphate receptor 3
Name:Sphingosine 1-phosphate receptor 3
Type:G Protein-Coupled Receptor (GPCR)
Mol. Mass.:42278.13
Organism:Homo sapiens (Human)
Description:Q99500
Residue:378
BDBM23165
NameBDBM23165
Synonyms:CHEMBL366208 [(2S)-2-amino-3-hydroxy-2-[2-(4-octylphenyl)ethyl]propoxy]phosphonic acid
TypeSmall organic molecule
Emp. Form.C19H34NO5P
Mol. Mass.387.4507
SMILESCCCCCCCCc1ccc(CC[C@](N)(CO)COP(O)(O)=O)cc1