Reaction Details
TargetSphingosine 1-phosphate receptor 1
LigandBDBM50360521
Substrate/Competitorn/a
Meas. Tech.ChEMBL_796733 (CHEMBL1938048)
EC50 2720±n/a nM
Citation He, XWang, LZheng, ZXiao, JZhong, WLi, S Novel immunomodulators based on an oxazolin-2-one-4-carboxamide scaffold. Bioorg Med Chem Lett22:553-7 (2011) 
 
Sphingosine 1-phosphate receptor 1
Name:Sphingosine 1-phosphate receptor 1
Type:Enzyme
Mol. Mass.:42836.02
Organism:Homo sapiens (Human)
Description:P21453
Residue:382
BDBM50360521
NameBDBM50360521
Synonyms:CHEMBL1935666
TypeSmall organic molecule
Emp. Form.C23H28N2O4
Mol. Mass.396.4794
SMILESCC(C)(C)c1ccc(COc2ccc(CCC3(COC(=O)N3)C(N)=O)cc2)cc1