Reaction Details
TargetSphingosine 1-phosphate receptor 4
LigandBDBM75606
Substrate/Competitorn/a
Meas. Tech.ChEMBL_795350 (CHEMBL1937206)
EC50 45±n/a nM
Citation Guerrero, MUrbano, MZhao, JCrisp, MChase, PHodder, PSchaeffer, MTBrown, SRosen, HRoberts, E Discovery, design and synthesis of novel potent and selective sphingosine-1-phosphate 4 receptor (S1P4-R) agonists. Bioorg Med Chem Lett22:537-42 (2011) 
 
Sphingosine 1-phosphate receptor 4
Name:Sphingosine 1-phosphate receptor 4
Type:G Protein-Coupled Receptor (GPCR)
Mol. Mass.:41647.39
Organism:Homo sapiens (Human)
Description:n/a
Residue:384
BDBM75606
NameBDBM75606
Synonyms:2-chloro-3-[2-(2,4-dichlorophenoxy)ethoxy]-6-(fluoromethyl)pyridine CYM50260 SR-02000000308-1 | cid_44620894
TypeSmall organic molecule
Emp. Form.C14H11Cl3FNO2
Mol. Mass.350.6
SMILESFCc1ccc(OCCOc2ccc(Cl)cc2Cl)c(Cl)n1