Reaction Details
TargetSphingosine 1-phosphate receptor 4
LigandBDBM75604
Substrate/Competitorn/a
Meas. Tech.ChEMBL_795350 (CHEMBL1937206)
EC50 52±n/a nM
Citation Guerrero, MUrbano, MZhao, JCrisp, MChase, PHodder, PSchaeffer, MTBrown, SRosen, HRoberts, E Discovery, design and synthesis of novel potent and selective sphingosine-1-phosphate 4 receptor (S1P4-R) agonists. Bioorg Med Chem Lett22:537-42 (2011) 
 
Sphingosine 1-phosphate receptor 4
Name:Sphingosine 1-phosphate receptor 4
Type:G Protein-Coupled Receptor (GPCR)
Mol. Mass.:41647.39
Organism:Homo sapiens (Human)
Description:n/a
Residue:384
BDBM75604
NameBDBM75604
Synonyms:2-bromo-3-[2-(2,4-dichlorophenoxy)ethoxy]-6-methyl-pyridine 3-[2-[2,4-bis(chloranyl)phenoxy]ethoxy]-2-bromanyl-6-methyl-pyridine SR-02000000306 cid_44620895
TypeSmall organic molecule
Emp. Form.C14H12BrCl2NO2
Mol. Mass.377.061
SMILESCc1ccc(OCCOc2ccc(Cl)cc2Cl)c(Br)n1