Reaction Details
TargetGlucagon receptor
LigandBDBM50360599
Substrate/Competitorn/a
Meas. Tech.ChEMBL_795440 (CHEMBL1937445)
Ki 9.00±n/a nM
Citation Filipski, KJBian, JEbner, DCLee, ECLi, JCSammons, MFWright, SWStevens, BDDidiuk, MTTu, MPerreault, CBrown, JAtkinson, KTan, BSalatto, CTLitchfield, JPfefferkorn, JAGuzman-Perez, A A novel series of glucagon receptor antagonists with reduced molecular weight and lipophilicity. Bioorg Med Chem Lett22:415-20 (2011) 
 
Glucagon receptor
Name:Glucagon receptor
Type:Enzyme
Mol. Mass.:54026.92
Organism:Homo sapiens (Human)
Description:P47871
Residue:477
BDBM50360599
NameBDBM50360599
Synonyms:CHEMBL1933365
TypeSmall organic molecule
Emp. Form.C26H27F3N4O3
Mol. Mass.500.5128
SMILESOC(=O)CCNC(=O)c1ccc(cc1)C(Nc1cnn(c1)-c1ccc(cc1)C(F)(F)F)C1CCCC1