Reaction Details
TargetInhibitor of nuclear factor kappa-B kinase subunit epsilon
LigandBDBM50360605
Substrate/Competitorn/a
Meas. Tech.ChEMBL_795645 (CHEMBL1936075)
IC50>30000±n/a nM
Citation Powell, NAKohrt, JTFilipski, KJKaufman, MSheehan, DEdmunds, JEDelaney, AWang, YBourbonais, FLee, DYSchwende, FSun, FMcConnell, PCatana, CChen, HOhren, JPerrin, LA Novel and selective spiroindoline-based inhibitors of Sky kinase. Bioorg Med Chem Lett22:190-3 (2011) 
 
Inhibitor of nuclear factor kappa-B kinase subunit epsilon
Name:Inhibitor of nuclear factor kappa-B kinase subunit epsilon
Type:Serine/threonine-protein kinase
Mol. Mass.:80475.98
Organism:Homo sapiens (Human)
Description:Kinase inhibitory activity was determined using recombinant human IKK-epsilon expressed in baculovirus as a FLAG-tagged fusion protein.
Residue:716
BDBM50360605
NameBDBM50360605
Synonyms:CHEMBL1933538
TypeSmall organic molecule
Emp. Form.C25H27FN4O
Mol. Mass.418.5065
SMILESFc1ccc2[nH]c(cc2c1)C(=O)N1C[C@]2(CCN(C2)C2CCCNC2)c2ccccc12