Reaction Details
TargetFibroblast growth factor receptor 1
LigandBDBM50360605
Substrate/Competitorn/a
Meas. Tech.ChEMBL_795653 (CHEMBL1936083)
IC50>30000±n/a nM
Citation Powell, NAKohrt, JTFilipski, KJKaufman, MSheehan, DEdmunds, JEDelaney, AWang, YBourbonais, FLee, DYSchwende, FSun, FMcConnell, PCatana, CChen, HOhren, JPerrin, LA Novel and selective spiroindoline-based inhibitors of Sky kinase. Bioorg Med Chem Lett22:190-3 (2011) 
 
Fibroblast growth factor receptor 1
Name:Fibroblast growth factor receptor 1
Type:Receptor
Mol. Mass.:91861.70
Organism:Homo sapiens (Human)
Description:P11362
Residue:822
BDBM50360605
NameBDBM50360605
Synonyms:CHEMBL1933538
TypeSmall organic molecule
Emp. Form.C25H27FN4O
Mol. Mass.418.5065
SMILESFc1ccc2[nH]c(cc2c1)C(=O)N1C[C@]2(CCN(C2)C2CCCNC2)c2ccccc12