Reaction Details
TargetCyclin-dependent kinase 2
LigandBDBM50360611
Substrate/Competitorn/a
Meas. Tech.ChEMBL_795639 (CHEMBL1936069)
IC50>30000±n/a nM
Citation Powell, NAKohrt, JTFilipski, KJKaufman, MSheehan, DEdmunds, JEDelaney, AWang, YBourbonais, FLee, DYSchwende, FSun, FMcConnell, PCatana, CChen, HOhren, JPerrin, LA Novel and selective spiroindoline-based inhibitors of Sky kinase. Bioorg Med Chem Lett22:190-3 (2011) 
 
Cyclin-dependent kinase 2
Name:Cyclin-dependent kinase 2
Type:Enzyme Subunit
Mol. Mass.:33938.17
Organism:Homo sapiens (Human)
Description:P24941
Residue:298
BDBM50360611
NameBDBM50360611
Synonyms:CHEMBL1933550
TypeSmall organic molecule
Emp. Form.C24H25FN4O
Mol. Mass.404.4799
SMILESFc1ccc2cc([nH]c2c1)C(=O)N1C[C@]2(CCN(C2)C2CCNC2)c2ccccc12