Reaction Details
Target[Pyruvate dehydrogenase (acetyl-transferring)] kinase isozyme 1, mitochondrial
LigandBDBM50360611
Substrate/Competitorn/a
Meas. Tech.ChEMBL_795649 (CHEMBL1936079)
IC50>30000±n/a nM
Citation Powell, NAKohrt, JTFilipski, KJKaufman, MSheehan, DEdmunds, JEDelaney, AWang, YBourbonais, FLee, DYSchwende, FSun, FMcConnell, PCatana, CChen, HOhren, JPerrin, LA Novel and selective spiroindoline-based inhibitors of Sky kinase. Bioorg Med Chem Lett22:190-3 (2011) 
 
[Pyruvate dehydrogenase (acetyl-transferring)] kinase isozyme 1, mitochondrial
Name:[Pyruvate dehydrogenase (acetyl-transferring)] kinase isozyme 1, mitochondrial
Type:Protein
Mol. Mass.:49255.23
Organism:Homo sapiens (Human)
Description:Q15118
Residue:436
BDBM50360611
NameBDBM50360611
Synonyms:CHEMBL1933550
TypeSmall organic molecule
Emp. Form.C24H25FN4O
Mol. Mass.404.4799
SMILESFc1ccc2cc([nH]c2c1)C(=O)N1C[C@]2(CCN(C2)C2CCNC2)c2ccccc12