Reaction Details
TargetTyrosine-protein kinase
LigandBDBM50360615
Substrate/Competitorn/a
Meas. Tech.ChEMBL_795546 (CHEMBL1935924)
IC50 811±n/a nM
Citation Powell, NAKohrt, JTFilipski, KJKaufman, MSheehan, DEdmunds, JEDelaney, AWang, YBourbonais, FLee, DYSchwende, FSun, FMcConnell, PCatana, CChen, HOhren, JPerrin, LA Novel and selective spiroindoline-based inhibitors of Sky kinase. Bioorg Med Chem Lett22:190-3 (2011) 
 
Tyrosine-protein kinase
Name:Tyrosine-protein kinase
Synonyms:Syk protein
Type:PROTEIN
Mol. Mass.:71353.61
Organism:Mus musculus
Description:ChEMBL_795546
Residue:629
BDBM50360615
NameBDBM50360615
Synonyms:CHEMBL1933544
TypeSmall organic molecule
Emp. Form.C25H28N4O
Mol. Mass.400.516
SMILESCc1ccc2[nH]c(cc2c1)C(=O)N1C[C@]2(CCN(C2)C2CCNC2)c2ccccc12