Reaction Details
TargetTyrosine-protein kinase
LigandBDBM50360620
Substrate/Competitorn/a
Meas. Tech.ChEMBL_795546 (CHEMBL1935924)
IC50 560±n/a nM
Citation Powell, NAKohrt, JTFilipski, KJKaufman, MSheehan, DEdmunds, JEDelaney, AWang, YBourbonais, FLee, DYSchwende, FSun, FMcConnell, PCatana, CChen, HOhren, JPerrin, LA Novel and selective spiroindoline-based inhibitors of Sky kinase. Bioorg Med Chem Lett22:190-3 (2011) 
 
Tyrosine-protein kinase
Name:Tyrosine-protein kinase
Synonyms:Syk protein
Type:PROTEIN
Mol. Mass.:71353.61
Organism:Mus musculus
Description:ChEMBL_795546
Residue:629
BDBM50360620
NameBDBM50360620
Synonyms:CHEMBL1933549
TypeSmall organic molecule
Emp. Form.C24H25ClN4O
Mol. Mass.420.935
SMILESClc1cccc2[nH]c(cc12)C(=O)N1C[C@]2(CCN(C2)C2CCNC2)c2ccccc12