Reaction Details
TargetGlycogen synthase kinase-3 beta
LigandBDBM50360609
Substrate/Competitorn/a
Meas. Tech.ChEMBL_795643 (CHEMBL1936073)
IC50>30000±n/a nM
Citation Powell, NAKohrt, JTFilipski, KJKaufman, MSheehan, DEdmunds, JEDelaney, AWang, YBourbonais, FLee, DYSchwende, FSun, FMcConnell, PCatana, CChen, HOhren, JPerrin, LA Novel and selective spiroindoline-based inhibitors of Sky kinase. Bioorg Med Chem Lett22:190-3 (2011) 
 
Glycogen synthase kinase-3 beta
Name:Glycogen synthase kinase-3 beta
Type:Enzyme
Mol. Mass.:46756.38
Organism:Homo sapiens (Human)
Description:P49841
Residue:420
BDBM50360609
NameBDBM50360609
Synonyms:CHEMBL1933551
TypeSmall organic molecule
Emp. Form.C26H30N4O
Mol. Mass.414.5426
SMILESC[C@@H]1CCC(CN1)N1CC[C@@]2(C1)CN(C(=O)c1cc3ccccc3[nH]1)c1ccccc21