Reaction Details
TargetMelanin-concentrating hormone receptor 2
LigandBDBM50360697
Substrate/Competitorn/a
Meas. Tech.ChEMBL_795932 (CHEMBL1936805)
IC50 10±n/a nM
Citation Chen, XMihalic, JFan, PLiang, LLindstrom, MWong, SYe, QFu, YJaen, JChen, JLDai, KLi, L Discovery and characterization of a potent and selective antagonist of melanin-concentrating hormone receptor 2. Bioorg Med Chem Lett22:363-6 (2011) 
 
Melanin-concentrating hormone receptor 2
Name:Melanin-concentrating hormone receptor 2
Type:Enzyme Catalytic Domain
Mol. Mass.:38862.16
Organism:Homo sapiens (Human)
Description:Melanin Concentrating Hormone 2 GPR145 HUMAN::Q969V1
Residue:340
BDBM50360697
NameBDBM50360697
Synonyms:CHEMBL1934116
TypeSmall organic molecule
Emp. Form.C26H26N2O
Mol. Mass.382.4974
SMILESO[C@@H]1Cc2ccccc2C11CCN(Cc2ccc3[nH]c4ccccc4c3c2)CC1