Reaction Details
TargetMelanin-concentrating hormone receptor 2
LigandBDBM50360683
Substrate/Competitorn/a
Meas. Tech.ChEMBL_795932 (CHEMBL1936805)
IC50 1±n/a nM
Citation Chen, XMihalic, JFan, PLiang, LLindstrom, MWong, SYe, QFu, YJaen, JChen, JLDai, KLi, L Discovery and characterization of a potent and selective antagonist of melanin-concentrating hormone receptor 2. Bioorg Med Chem Lett22:363-6 (2011) 
 
Melanin-concentrating hormone receptor 2
Name:Melanin-concentrating hormone receptor 2
Type:Enzyme Catalytic Domain
Mol. Mass.:38862.16
Organism:Homo sapiens (Human)
Description:Melanin Concentrating Hormone 2 GPR145 HUMAN::Q969V1
Residue:340
BDBM50360683
NameBDBM50360683
Synonyms:CHEMBL1934130
TypeSmall organic molecule
Emp. Form.C29H30N4O2
Mol. Mass.466.5741
SMILESCC(=O)N[C@@H]1CC2(CCN(Cc3ccc4n(C(N)=O)c5ccccc5c4c3)CC2)c2ccccc12