Reaction Details
TargetProstaglandin E synthase
LigandBDBM50360824
Substrate/Competitorn/a
Meas. Tech.ChEMBL_796762 (CHEMBL1938077)
IC50 687±n/a nM
Citation Shiro, TTakahashi, HKakiguchi, KInoue, YMasuda, KNagata, HTobe, M Synthesis and SAR study of imidazoquinolines as a novel structural class of microsomal prostaglandin E2 synthase-1 inhibitors. Bioorg Med Chem Lett22:285-8 (2011) 
 
Prostaglandin E synthase
Name:Prostaglandin E synthase
Type:Protein
Mol. Mass.:17112.22
Organism:Homo sapiens (Human)
Description:n/a
Residue:152
BDBM50360824
NameBDBM50360824
Synonyms:CHEMBL1934802
TypeSmall organic molecule
Emp. Form.C17H9BrN4
Mol. Mass.349.184
SMILESBrc1ccc2c3nc([nH]c3cnc2c1)-c1ccccc1C#N