Reaction Details
TargetHistamine H3 receptor
LigandBDBM50360902
Substrate/Competitorn/a
Meas. Tech.ChEMBL_795470 (CHEMBL1937475)
EC50 0.73±n/a nM
Citation Hudkins, RLAimone, LDDandu, RRDunn, DGruner, JAHuang, ZJosef, KALyons, JAMathiasen, JRTao, MZulli, ALRaddatz, R 4,5-dihydropyridazin-3-one derivatives as histamine H3 receptor inverse agonists. Bioorg Med Chem Lett22:194-8 (2011) 
 
Histamine H3 receptor
Name:Histamine H3 receptor
Type:G Protein-Coupled Receptor (GPCR)
Mol. Mass.:48691.47
Organism:Homo sapiens (Human)
Description:Binding assays were using CHO cells stably expressing hH3R receptors.
Residue:445
BDBM50360902
NameBDBM50360902
Synonyms:CHEMBL1935114
TypeSmall organic molecule
Emp. Form.C20H29N3O2
Mol. Mass.343.4632
SMILESC[C@@H]1CCCN1CCCOc1ccc(cc1)C1=NNC(=O)C(C)(C)C1