Reaction Details
TargetMacrophage metalloelastase
LigandBDBM50360953
Substrate/Competitorn/a
Meas. Tech.ChEMBL_796143 (CHEMBL1937507)
IC50 2.3±n/a nM
Citation Wu, YLi, JWu, JMorgan, PXu, XRancati, FVallese, SRaveglia, LHotchandani, RFuller, NBard, JCunningham, KFish, SKrykbaev, RTam, SGoldman, SJWilliams, CMansour, TSSaiah, ESypek, JLi, W Discovery of potent and selective matrix metalloprotease 12 inhibitors for the potential treatment of chronic obstructive pulmonary disease (COPD). Bioorg Med Chem Lett22:138-43 (2011) 
 
Macrophage metalloelastase
Name:Macrophage metalloelastase
Type:Enzyme
Mol. Mass.:54012.99
Organism:Homo sapiens (Human)
Description:P39900
Residue:470
BDBM50360953
NameBDBM50360953
Synonyms:CHEMBL1935301
TypeSmall organic molecule
Emp. Form.C23H23N3O6S
Mol. Mass.469.51
SMILESCC(C)[C@H](NS(=O)(=O)c1ccc2c(c1)oc1ccc(cc21)-c1noc(n1)C1CCC1)C(O)=O