Reaction Details
TargetMuscarinic acetylcholine receptor M1
LigandBDBM50361008
Substrate/Competitorn/a
Meas. Tech.ChEMBL_796226 (CHEMBL1938191)
Ki 230±n/a nM
Citation Ravula, SBYu, JTran, JAArellano, MTucci, FCMoree, WJLi, BFPetroski, REWen, JMalany, SHoare, SRMadan, ACrowe, PDBeaton, G Lead optimization of 2-(piperidin-3-yl)-1H-benzimidazoles: identification of 2-morpholin- and 2-thiomorpholin-2-yl-1H-benzimidazoles as selective and CNS penetrating H¿?-antihistamines for insomnia. Bioorg Med Chem Lett22:421-6 (2011) 
 
Muscarinic acetylcholine receptor M1
Name:Muscarinic acetylcholine receptor M1
Type:Protein
Mol. Mass.:51442.54
Organism:Homo sapiens (Human)
Description:P11229
Residue:460
BDBM50361008
NameBDBM50361008
Synonyms:CHEMBL1935446
TypeSmall organic molecule
Emp. Form.C18H18FN3S
Mol. Mass.327.419
SMILESFc1ccc(Cn2c(nc3ccccc23)[C@H]2CNCCS2)cc1