Reaction Details
TargetHistamine H1 receptor
LigandBDBM50360994
Substrate/Competitorn/a
Meas. Tech.ChEMBL_796225 (CHEMBL1938190)
Ki 8.9±n/a nM
Citation Ravula, SBYu, JTran, JAArellano, MTucci, FCMoree, WJLi, BFPetroski, REWen, JMalany, SHoare, SRMadan, ACrowe, PDBeaton, G Lead optimization of 2-(piperidin-3-yl)-1H-benzimidazoles: identification of 2-morpholin- and 2-thiomorpholin-2-yl-1H-benzimidazoles as selective and CNS penetrating H¿?-antihistamines for insomnia. Bioorg Med Chem Lett22:421-6 (2011) 
 
Histamine H1 receptor
Name:Histamine H1 receptor
Type:G Protein-Coupled Receptor (GPCR)
Mol. Mass.:55808.72
Organism:Homo sapiens (Human)
Description:Cell pellets from SK-N-MC cells transfected with human H1 receptor were used in binding assay.
Residue:487
BDBM50360994
NameBDBM50360994
Synonyms:CHEMBL1935431
TypeSmall organic molecule
Emp. Form.C23H27FN4O
Mol. Mass.394.4851
SMILESCN(C)C(=O)CN1CCCC(C1)c1nc2ccccc2n1Cc1ccc(F)cc1