Reaction Details
TargetHistamine H1 receptor
LigandBDBM50316940
Substrate/Competitorn/a
Meas. Tech.ChEMBL_796225 (CHEMBL1938190)
Ki 0.9±n/a nM
Citation Ravula, SBYu, JTran, JAArellano, MTucci, FCMoree, WJLi, BFPetroski, REWen, JMalany, SHoare, SRMadan, ACrowe, PDBeaton, G Lead optimization of 2-(piperidin-3-yl)-1H-benzimidazoles: identification of 2-morpholin- and 2-thiomorpholin-2-yl-1H-benzimidazoles as selective and CNS penetrating H¿?-antihistamines for insomnia. Bioorg Med Chem Lett22:421-6 (2011) 
 
Histamine H1 receptor
Name:Histamine H1 receptor
Type:G Protein-Coupled Receptor (GPCR)
Mol. Mass.:55808.72
Organism:Homo sapiens (Human)
Description:Cell pellets from SK-N-MC cells transfected with human H1 receptor were used in binding assay.
Residue:487
BDBM50316940
NameBDBM50316940
Synonyms:(R)-1-(4-fluorobenzyl)-2-(1-methylpiperidin-3-yl)-1H-benzo[d]imidazole | CHEMBL1095819
TypeSmall organic molecule
Emp. Form.C20H22FN3
Mol. Mass.323.4072
SMILESCN1CCC[C@H](C1)c1nc2ccccc2n1Cc1ccc(F)cc1