Reaction Details
TargetHistamine H4 receptor
LigandBDBM50361012
Substrate/Competitorn/a
Meas. Tech.ChEMBL_796037 (CHEMBL1936570)
Ki 23±n/a nM
Citation Smits, RALim, HDvan der Meer, TKuhne, SBessembinder, KZuiderveld, OPWijtmans, Mde Esch, IJLeurs, R Ligand based design of novel histamine H4 receptor antagonists; fragment optimization and analysis of binding kinetics. Bioorg Med Chem Lett22:461-7 (2011) 
 
Histamine H4 receptor
Name:Histamine H4 receptor
Type:G Protein-Coupled Receptor (GPCR)
Mol. Mass.:44272.75
Organism:Mus musculus (mouse)
Description:Cell pellets from SK-N-MC cells transfected with mouse H4 receptor were used in binding assay.
Residue:391
BDBM50361012
NameBDBM50361012
Synonyms:CHEMBL1935574
TypeSmall organic molecule
Emp. Form.C16H17N5O
Mol. Mass.295.3391
SMILESNc1nc(N2CCNCC2)c2ccc(cc2n1)-c1ccco1