Reaction Details
TargetHistamine H4 receptor
LigandBDBM22566
Substrate/Competitorn/a
Meas. Tech.ChEMBL_795783 (CHEMBL1936670)
Ki 6±n/a nM
Citation Smits, RALim, HDvan der Meer, TKuhne, SBessembinder, KZuiderveld, OPWijtmans, Mde Esch, IJLeurs, R Ligand based design of novel histamine H4 receptor antagonists; fragment optimization and analysis of binding kinetics. Bioorg Med Chem Lett22:461-7 (2011) 
 
Histamine H4 receptor
Name:Histamine H4 receptor
Type:G Protein-Coupled Receptor (GPCR)
Mol. Mass.:44517.02
Organism:Homo sapiens (Human)
Description:Binding assays were using CHO cells stably expressing hH4R receptors.
Residue:390
BDBM22566
NameBDBM22566
Synonyms:5-chloro-2-[(4-methylpiperazin-1-yl)carbonyl]-1H-indole JNJ 7777120
TypeSmall organic molecule
Emp. Form.C14H16ClN3O
Mol. Mass.277.749
SMILESCN1CCN(CC1)C(=O)c1cc2cc(Cl)ccc2[nH]1