Reaction Details
TargetHistamine H4 receptor
LigandBDBM26396
Substrate/Competitorn/a
Meas. Tech.ChEMBL_795785 (CHEMBL1936672)
Ki 5±n/a nM
Citation Smits, RALim, HDvan der Meer, TKuhne, SBessembinder, KZuiderveld, OPWijtmans, Mde Esch, IJLeurs, R Ligand based design of novel histamine H4 receptor antagonists; fragment optimization and analysis of binding kinetics. Bioorg Med Chem Lett22:461-7 (2011) 
 
Histamine H4 receptor
Name:Histamine H4 receptor
Type:G Protein-Coupled Receptor (GPCR)
Mol. Mass.:44517.02
Organism:Homo sapiens (Human)
Description:Binding assays were using CHO cells stably expressing hH4R receptors.
Residue:390
BDBM26396
NameBDBM26396
Synonyms:2,4-diamino-5,6-disubstituted pyrimidine, 10 A-943931
TypeSmall organic molecule
Emp. Form.C17H21N5
Mol. Mass.295.3821
SMILESN[C@@H]1CCN(C1)c1nc(N)nc-2c1CCCc1ccccc-21