Reaction Details
TargetHistamine H4 receptor
LigandBDBM50361013
Substrate/Competitorn/a
Meas. Tech.ChEMBL_795785 (CHEMBL1936672)
Ki 6±n/a nM
Citation Smits, RALim, HDvan der Meer, TKuhne, SBessembinder, KZuiderveld, OPWijtmans, Mde Esch, IJLeurs, R Ligand based design of novel histamine H4 receptor antagonists; fragment optimization and analysis of binding kinetics. Bioorg Med Chem Lett22:461-7 (2011) 
 
Histamine H4 receptor
Name:Histamine H4 receptor
Type:G Protein-Coupled Receptor (GPCR)
Mol. Mass.:44517.02
Organism:Homo sapiens (Human)
Description:Binding assays were using CHO cells stably expressing hH4R receptors.
Residue:390
BDBM50361013
NameBDBM50361013
Synonyms:CHEMBL1935450
TypeSmall organic molecule
Emp. Form.C18H25N5O
Mol. Mass.327.424
SMILESNc1nc(N2CCNCC2)c2CCC3=C([C@H]4CCCC[C@H]4O3)c2n1