Reaction Details
TargetHistamine H4 receptor
LigandBDBM50179335
Substrate/Competitorn/a
Meas. Tech.ChEMBL_795785 (CHEMBL1936672)
Ki 26±n/a nM
Citation Smits, RALim, HDvan der Meer, TKuhne, SBessembinder, KZuiderveld, OPWijtmans, Mde Esch, IJLeurs, R Ligand based design of novel histamine H4 receptor antagonists; fragment optimization and analysis of binding kinetics. Bioorg Med Chem Lett22:461-7 (2011) 
 
Histamine H4 receptor
Name:Histamine H4 receptor
Type:G Protein-Coupled Receptor (GPCR)
Mol. Mass.:44517.02
Organism:Homo sapiens (Human)
Description:Binding assays were using CHO cells stably expressing hH4R receptors.
Residue:390
BDBM50179335
NameBDBM50179335
Synonyms:(5-Chloro-1H-benzoimidazol-2-yl)-(4-methyl-piperazin-1-yl)-methanone CHEMBL185951
TypeSmall organic molecule
Emp. Form.C13H15ClN4O
Mol. Mass.278.737
SMILESCN1CCN(CC1)C(=O)c1nc2ccc(Cl)cc2[nH]1