Reaction Details
TargetHistamine H4 receptor
LigandBDBM50361010
Substrate/Competitorn/a
Meas. Tech.ChEMBL_795794 (CHEMBL1936681)
Ki 3±n/a nM
Citation Smits, RALim, HDvan der Meer, TKuhne, SBessembinder, KZuiderveld, OPWijtmans, Mde Esch, IJLeurs, R Ligand based design of novel histamine H4 receptor antagonists; fragment optimization and analysis of binding kinetics. Bioorg Med Chem Lett22:461-7 (2011) 
 
Histamine H4 receptor
Name:Histamine H4 receptor
Type:G Protein-Coupled Receptor (GPCR)
Mol. Mass.:44517.02
Organism:Homo sapiens (Human)
Description:Binding assays were using CHO cells stably expressing hH4R receptors.
Residue:390
BDBM50361010
NameBDBM50361010
Synonyms:CHEMBL1935572
TypeSmall organic molecule
Emp. Form.C17H19N5S
Mol. Mass.325.431
SMILESCN1CCN(CC1)c1nc(N)nc2cc(ccc12)-c1ccsc1