Reaction Details
TargetSphingosine 1-phosphate receptor 1
LigandBDBM50361037
Substrate/Competitorn/a
Meas. Tech.ChEMBL_796042 (CHEMBL1936575)
EC50 0.84±n/a nM
Citation Kurata, HKusumi, KOtsuki, KSuzuki, RKurono, MTokuda, NTakada, YShioya, HMizuno, HKomiya, TOno, THagiya, HMinami, MNakade, SHabashita, H Structure-activity relationship studies of S1P agonists with a dihydronaphthalene scaffold. Bioorg Med Chem Lett22:144-8 (2011) 
 
Sphingosine 1-phosphate receptor 1
Name:Sphingosine 1-phosphate receptor 1
Type:Enzyme
Mol. Mass.:42836.02
Organism:Homo sapiens (Human)
Description:P21453
Residue:382
BDBM50361037
NameBDBM50361037
Synonyms:CHEMBL1935576
TypeSmall organic molecule
Emp. Form.C25H28FNO3
Mol. Mass.409.4931
SMILESCC1=C(CN2CC(C2)C(O)=O)CCc2cc(OCCCc3ccc(F)cc3)ccc12