Reaction Details
TargetSphingosine 1-phosphate receptor 1
LigandBDBM50361041
Substrate/Competitorn/a
Meas. Tech.ChEMBL_796042 (CHEMBL1936575)
EC50 0.66±n/a nM
Citation Kurata, HKusumi, KOtsuki, KSuzuki, RKurono, MTokuda, NTakada, YShioya, HMizuno, HKomiya, TOno, THagiya, HMinami, MNakade, SHabashita, H Structure-activity relationship studies of S1P agonists with a dihydronaphthalene scaffold. Bioorg Med Chem Lett22:144-8 (2011) 
 
Sphingosine 1-phosphate receptor 1
Name:Sphingosine 1-phosphate receptor 1
Type:Enzyme
Mol. Mass.:42836.02
Organism:Homo sapiens (Human)
Description:P21453
Residue:382
BDBM50361041
NameBDBM50361041
Synonyms:CHEMBL1935580
TypeSmall organic molecule
Emp. Form.C26H31NO3
Mol. Mass.405.5292
SMILESCC(COc1ccc2C(C)=C(CN3CC(C3)C(O)=O)CCc2c1)Cc1ccccc1