Reaction Details
Target5-hydroxytryptamine receptor 6
LigandBDBM50361053
Substrate/Competitorn/a
Meas. Tech.ChEMBL_796060 (CHEMBL1936930)
Ki 130±n/a nM
Citation Sundar, BGBailey, TRDunn, DDBacon, ERSalvino, JMMorton, GCAimone, LDZeqi, HMathiasen, JRDicamillo, AHuffman, MJMcKenna, BAKopec, KLu, LDBrown, RQian, JAngeles, TConnors, TSpais, CHolskin, BGalinis, DDuzic, ESchaffhauser, HRosse, GC Novel brain penetrant benzofuropiperidine 5-HT6 receptor antagonists. Bioorg Med Chem Lett22:120-3 (2011) 
 
5-hydroxytryptamine receptor 6
Name:5-hydroxytryptamine receptor 6
Type:G Protein-Coupled Receptor (GPCR)
Mol. Mass.:46968.43
Organism:Homo sapiens (Human)
Description:P50406
Residue:440
BDBM50361053
NameBDBM50361053
Synonyms:CHEMBL1935601
TypeSmall organic molecule
Emp. Form.C21H20FNO4S
Mol. Mass.401.451
SMILESFc1cccc(c1)S(=O)(=O)c1ccc2c3CCNC4(CCCOC4)c3oc2c1