Reaction Details
TargetTyrosine-protein kinase ABL1
LigandBDBM50361089
Substrate/Competitorn/a
Meas. Tech.ChEMBL_795077 (CHEMBL1936503)
IC50>10000±n/a nM
Citation Caruso, MValsasina, BBallinari, DBertrand, JBrasca, MGCaldarelli, MCappella, PFiorentini, FGianellini, LMScolaro, ABeria, I 5-(2-amino-pyrimidin-4-yl)-1H-pyrrole and 2-(2-amino-pyrimidin-4-yl)-1,5,6,7-tetrahydro-pyrrolo[3,2-c]pyridin-4-one derivatives as new classes of selective and orally available Polo-like kinase 1 inhibitors. Bioorg Med Chem Lett22:96-101 (2011) 
 
Tyrosine-protein kinase ABL1
Name:Tyrosine-protein kinase ABL1
Type:Enzyme
Mol. Mass.:122897.30
Organism:Homo sapiens (Human)
Description:P00519
Residue:1130
BDBM50361089
NameBDBM50361089
Synonyms:CHEMBL1933576
TypeSmall organic molecule
Emp. Form.C22H24F3N7O2
Mol. Mass.475.4669
SMILESCN1CCN(CC1)c1ccc(OC(F)(F)F)c(Nc2nccc(n2)-c2cc(cn2C)C(N)=O)c1