Reaction Details
TargetSerine/threonine-protein kinase PLK3
LigandBDBM50361091
Substrate/Competitorn/a
Meas. Tech.ChEMBL_795023 (CHEMBL1936403)
IC50>10000±n/a nM
Citation Caruso, MValsasina, BBallinari, DBertrand, JBrasca, MGCaldarelli, MCappella, PFiorentini, FGianellini, LMScolaro, ABeria, I 5-(2-amino-pyrimidin-4-yl)-1H-pyrrole and 2-(2-amino-pyrimidin-4-yl)-1,5,6,7-tetrahydro-pyrrolo[3,2-c]pyridin-4-one derivatives as new classes of selective and orally available Polo-like kinase 1 inhibitors. Bioorg Med Chem Lett22:96-101 (2011) 
 
Serine/threonine-protein kinase PLK3
Name:Serine/threonine-protein kinase PLK3
Type:Serine/threonine-protein kinase
Mol. Mass.:71655.17
Organism:Homo sapiens (Human)
Description:Enzyme assays were using PLK3 purified from baculovirus-infected Trichoplusia ni cells expressing full-length PLK3.
Residue:646
BDBM50361091
NameBDBM50361091
Synonyms:CHEMBL1933578
TypeSmall organic molecule
Emp. Form.C21H22F3N7O2
Mol. Mass.461.4403
SMILESCn1cc(cc1-c1ccnc(Nc2cc(ccc2OC(F)(F)F)N2CCNCC2)n1)C(N)=O