Reaction Details
TargetcAMP-dependent protein kinase catalytic subunit alpha
LigandBDBM50361088
Substrate/Competitorn/a
Meas. Tech.ChEMBL_795154 (CHEMBL1936626)
IC50>10000±n/a nM
Citation Caruso, MValsasina, BBallinari, DBertrand, JBrasca, MGCaldarelli, MCappella, PFiorentini, FGianellini, LMScolaro, ABeria, I 5-(2-amino-pyrimidin-4-yl)-1H-pyrrole and 2-(2-amino-pyrimidin-4-yl)-1,5,6,7-tetrahydro-pyrrolo[3,2-c]pyridin-4-one derivatives as new classes of selective and orally available Polo-like kinase 1 inhibitors. Bioorg Med Chem Lett22:96-101 (2011) 
 
cAMP-dependent protein kinase catalytic subunit alpha
Name:cAMP-dependent protein kinase catalytic subunit alpha
Type:Enzyme Catalytic Subunit
Mol. Mass.:40598.73
Organism:Homo sapiens (Human)
Description:n/a
Residue:351
BDBM50361088
NameBDBM50361088
Synonyms:CHEMBL1933582
TypeSmall organic molecule
Emp. Form.C24H26F3N7O2
Mol. Mass.501.5041
SMILESCN1CCN(CC1)c1ccc(OC(F)(F)F)c(Nc2nccc(n2)-c2cc3c(CCNC3=O)n2C)c1