Reaction Details
TargetVascular endothelial growth factor receptor 2
LigandBDBM50361194
Substrate/Competitorn/a
Meas. Tech.ChEMBL_794697 (CHEMBL1937306)
IC50 237±n/a nM
Citation Yu, BTang, LDLi, YLSong, SHJi, XLLin, MSWu, CF Design, synthesis and antitumor activity of 4-aminoquinazoline derivatives targeting VEGFR-2 tyrosine kinase. Bioorg Med Chem Lett22:110-4 (2011) 
 
Vascular endothelial growth factor receptor 2
Name:Vascular endothelial growth factor receptor 2
Type:Receptor Tyrosine Kinase
Mol. Mass.:151510.97
Organism:Homo sapiens (Human)
Description:P35968
Residue:1356
BDBM50361194
NameBDBM50361194
Synonyms:CHEMBL1934325
TypeSmall organic molecule
Emp. Form.C28H36N6O2
Mol. Mass.488.6244
SMILESCN1CCC(COc2ccc3c(Nc4ccc(NC(=O)NC5CCCCC5)cc4)ncnc3c2)CC1