Reaction Details
TargetPlatelet-derived growth factor receptor beta
LigandBDBM50361196
Substrate/Competitorn/a
Meas. Tech.ChEMBL_794702 (CHEMBL1937311)
IC50 2788±n/a nM
Citation Yu, BTang, LDLi, YLSong, SHJi, XLLin, MSWu, CF Design, synthesis and antitumor activity of 4-aminoquinazoline derivatives targeting VEGFR-2 tyrosine kinase. Bioorg Med Chem Lett22:110-4 (2011) 
 
Platelet-derived growth factor receptor beta
Name:Platelet-derived growth factor receptor beta
Type:Enzyme
Mol. Mass.:123922.25
Organism:Homo sapiens (Human)
Description:P09619
Residue:1106
BDBM50361196
NameBDBM50361196
Synonyms:CHEMBL1934327
TypeSmall organic molecule
Emp. Form.C28H29FN6O2
Mol. Mass.500.5673
SMILESCN1CCC(COc2ccc3c(Nc4ccc(NC(=O)Nc5cccc(F)c5)cc4)ncnc3c2)CC1