Reaction Details
TargetTyrosine-protein kinase JAK2
LigandBDBM50361215
Substrate/Competitorn/a
Meas. Tech.ChEMBL_794849 (CHEMBL1936085)
IC50 2.1±n/a nM
Citation Zificsak, CAGingrich, DEBreslin, HJDunn, DDMilkiewicz, KLTheroff, JPThieu, TVUnderiner, TLWeinberg, LRAimone, LDAlbom, MSMason, JLSaville, LHusten, JAngeles, TSFinn, JPJan, MO'Kane, TMDobrzanski, PDorsey, BD Optimization of a novel kinase inhibitor scaffold for the dual inhibition of JAK2 and FAK kinases. Bioorg Med Chem Lett22:133-7 (2011) 
 
Tyrosine-protein kinase JAK2
Name:Tyrosine-protein kinase JAK2
Type:Protein
Mol. Mass.:130684.68
Organism:Homo sapiens (Human)
Description:O60674
Residue:1132
BDBM50361215
NameBDBM50361215
Synonyms:CHEMBL1934344
TypeSmall organic molecule
Emp. Form.C26H30N8O3S
Mol. Mass.534.633
SMILESCN(c1ncccc1-c1ccc2cnc(Nc3ccc(cc3)C3CCN(CC(N)=O)CC3)nn12)S(C)(=O)=O