Reaction Details
TargetFocal adhesion kinase 1
LigandBDBM50361221
Substrate/Competitorn/a
Meas. Tech.ChEMBL_794848 (CHEMBL1936031)
IC50 205±n/a nM
Citation Zificsak, CAGingrich, DEBreslin, HJDunn, DDMilkiewicz, KLTheroff, JPThieu, TVUnderiner, TLWeinberg, LRAimone, LDAlbom, MSMason, JLSaville, LHusten, JAngeles, TSFinn, JPJan, MO'Kane, TMDobrzanski, PDorsey, BD Optimization of a novel kinase inhibitor scaffold for the dual inhibition of JAK2 and FAK kinases. Bioorg Med Chem Lett22:133-7 (2011) 
 
Focal adhesion kinase 1
Name:Focal adhesion kinase 1
Type:Tyrosine-protein kinase
Mol. Mass.:119233.17
Organism:Homo sapiens (Human)
Description:Q05397
Residue:1052
BDBM50361221
NameBDBM50361221
Synonyms:CHEMBL1934350
TypeSmall organic molecule
Emp. Form.C28H31N7O3S
Mol. Mass.545.656
SMILESCS(=O)(=O)N1Cc2cccc(c2C1)-c1ccc2cnc(Nc3ccc(cc3)C3CCN(CC(N)=O)CC3)nn12