Reaction Details
TargetHistone deacetylase-like amidohydrolase
LigandBDBM50361256
Substrate/Competitorn/a
Meas. Tech.ChEMBL_795335 (CHEMBL1937191)
Kd 190±n/a nM
Citation Henkes, LMHaus, PJäger, FLudwig, JMeyer-Almes, FJ Synthesis and biochemical analysis of 2,2,3,3,4,4,5,5,6,6,7,7-dodecafluoro-N-hydroxy-octanediamides as inhibitors of human histone deacetylases. Bioorg Med Chem20:985-95 (2012) 
 
Histone deacetylase-like amidohydrolase
Name:Histone deacetylase-like amidohydrolase
Type:PROTEIN
Mol. Mass.:39419.78
Organism:Alcaligenes sp. (strain DSM 11172) (Bordetella sp. (strain FB188))
Description:ChEMBL_827139
Residue:369
BDBM50361256
NameBDBM50361256
Synonyms:CHEMBL1934898
TypeSmall organic molecule
Emp. Form.C16H12F12N2O3
Mol. Mass.508.2589
SMILESCCc1cccc(NC(=O)C(F)(F)C(F)(F)C(F)(F)C(F)(F)C(F)(F)C(F)(F)C(=O)NO)c1