Reaction Details
TargetHistone deacetylase 8
LigandBDBM50361250
Substrate/Competitorn/a
Meas. Tech.ChEMBL_795339 (CHEMBL1937195)
Kd 35000±n/a nM
Citation Henkes, LMHaus, PJäger, FLudwig, JMeyer-Almes, FJ Synthesis and biochemical analysis of 2,2,3,3,4,4,5,5,6,6,7,7-dodecafluoro-N-hydroxy-octanediamides as inhibitors of human histone deacetylases. Bioorg Med Chem20:985-95 (2012) 
 
Histone deacetylase 8
Name:Histone deacetylase 8
Type:Enzyme
Mol. Mass.:41749.60
Organism:Homo sapiens (Human)
Description:Q9BY41
Residue:377
BDBM50361250
NameBDBM50361250
Synonyms:CHEMBL1934892
TypeSmall organic molecule
Emp. Form.C14H7ClF12N2O3
Mol. Mass.514.651
SMILESONC(=O)C(F)(F)C(F)(F)C(F)(F)C(F)(F)C(F)(F)C(F)(F)C(=O)Nc1ccc(Cl)cc1