Reaction Details
TargetHistone deacetylase 8
LigandBDBM50361251
Substrate/Competitorn/a
Meas. Tech.ChEMBL_795339 (CHEMBL1937195)
Kd 36000±n/a nM
Citation Henkes, LMHaus, PJäger, FLudwig, JMeyer-Almes, FJ Synthesis and biochemical analysis of 2,2,3,3,4,4,5,5,6,6,7,7-dodecafluoro-N-hydroxy-octanediamides as inhibitors of human histone deacetylases. Bioorg Med Chem20:985-95 (2012) 
 
Histone deacetylase 8
Name:Histone deacetylase 8
Type:Enzyme
Mol. Mass.:41749.60
Organism:Homo sapiens (Human)
Description:Q9BY41
Residue:377
BDBM50361251
NameBDBM50361251
Synonyms:CHEMBL1934893
TypeSmall organic molecule
Emp. Form.C16H11F12N3O4
Mol. Mass.537.2571
SMILESCC(=O)Nc1ccc(NC(=O)C(F)(F)C(F)(F)C(F)(F)C(F)(F)C(F)(F)C(F)(F)C(=O)NO)cc1