Reaction Details
TargetHistone deacetylase 8
LigandBDBM50361268
Substrate/Competitorn/a
Meas. Tech.ChEMBL_795339 (CHEMBL1937195)
Kd>100000±n/a nM
Citation Henkes, LMHaus, PJäger, FLudwig, JMeyer-Almes, FJ Synthesis and biochemical analysis of 2,2,3,3,4,4,5,5,6,6,7,7-dodecafluoro-N-hydroxy-octanediamides as inhibitors of human histone deacetylases. Bioorg Med Chem20:985-95 (2012) 
 
Histone deacetylase 8
Name:Histone deacetylase 8
Type:Enzyme
Mol. Mass.:41749.60
Organism:Homo sapiens (Human)
Description:Q9BY41
Residue:377
BDBM50361268
NameBDBM50361268
Synonyms:CHEMBL1934910
TypeSmall organic molecule
Emp. Form.C20H12F12N2O2
Mol. Mass.540.3023
SMILESFC(F)(C(=O)Nc1ccccc1)C(F)(F)C(F)(F)C(F)(F)C(F)(F)C(F)(F)C(=O)Nc1ccccc1