Reaction Details
TargetPeroxisome proliferator-activated receptor gamma
LigandBDBM50361340
Substrate/Competitorn/a
Meas. Tech.ChEMBL_795138 (CHEMBL1936610)
IC50 21±n/a nM
Citation Rikimaru, KWakabayashi, TAbe, HImoto, HMaekawa, TUjikawa, OMurase, KMatsuo, TMatsumoto, MNomura, CTsuge, HArimura, NKawakami, KSakamoto, JFunami, MMol, CDSnell, GPBragstad, KASang, BCDougan, DRTanaka, TKatayama, NHoriguchi, YMomose, Y A new class of non-thiazolidinedione, non-carboxylic-acid-based highly selective peroxisome proliferator-activated receptor (PPAR)¿ agonists: design and synthesis of benzylpyrazole acylsulfonamides. Bioorg Med Chem20:714-33 (2012) 
 
Peroxisome proliferator-activated receptor gamma
Name:Peroxisome proliferator-activated receptor gamma
Type:Nuclear Receptor
Mol. Mass.:57613.46
Organism:Homo sapiens (Human)
Description:P37231
Residue:505
BDBM50361340
NameBDBM50361340
Synonyms:CHEMBL1933822
TypeSmall organic molecule
Emp. Form.C22H29ClF3N3O4S
Mol. Mass.523.997
SMILESCCCCCS(=O)(=O)NC(=O)CCc1cc(OC(C)C)nn1Cc1ccc(cc1Cl)C(F)(F)F